Results 1 to 5 of 5

Thread: error install Directadmin with Centos 6 in Kernel 2.6.32-042stab126.1

  1. #1
    Join Date
    Dec 2017
    Posts
    1

    error install Directadmin with Centos 6 in Kernel 2.6.32-042stab126.1

    Done. Making libxslt-1.1.32...
    Trying to make libxslt...
    make all-recursive
    make[1]: Entering directory `/usr/local/directadmin/custombuild/libxslt-1.1.32'
    Making all in libxslt
    make[2]: Entering directory `/usr/local/directadmin/custombuild/libxslt-1.1.32/libxslt'
    CC attrvt.lo
    CC xslt.lo
    CC xsltlocale.lo
    CC xsltutils.lo
    CC pattern.lo
    CC templates.lo
    CC variables.lo
    CC keys.lo
    CC numbers.lo
    CC extensions.lo
    CC extra.lo
    extensions.c: In function 'xsltExtModuleRegisterDynamic':
    extensions.c:392: warning: pointer targets in passing argument 3 of 'xmlStrPrintf' differ in signedness
    /usr/local/include/libxml2/libxml/xmlstring.h:98: note: expected 'const xmlChar *' but argument is of type 'char *'
    CC functions.lo
    CC namespaces.lo
    CC imports.lo
    CC attributes.lo
    CC documents.lo
    CC preproc.lo
    CC transform.lo
    CC security.lo
    CCLD libxslt.la
    make[2]: Leaving directory `/usr/local/directadmin/custombuild/libxslt-1.1.32/libxslt'
    Making all in libexslt
    make[2]: Entering directory `/usr/local/directadmin/custombuild/libxslt-1.1.32/libexslt'
    CC exslt.lo
    CC common.lo
    CC crypto.lo
    CC math.lo
    CC sets.lo
    CC functions.lo
    CC strings.lo
    CC date.lo
    CC saxon.lo
    CC dynamic.lo
    strings.c: In function 'exsltStrPaddingFunction':
    strings.c:414: warning: implicit declaration of function 'xmlBufferDetach'
    strings.c:414: warning: passing argument 1 of 'xmlXPathWrapString' makes pointer from integer without a cast
    /usr/local/include/libxml2/libxml/xpathInternals.h:490: note: expected 'xmlChar *' but argument is of type 'int'
    strings.c: In function 'exsltStrConcatFunction':
    strings.c:549: warning: passing argument 1 of 'xmlXPathWrapString' makes pointer from integer without a cast
    /usr/local/include/libxml2/libxml/xpathInternals.h:490: note: expected 'xmlChar *' but argument is of type 'int'
    date.c: In function '_exsltDateParseGYear':
    date.c:223: error: 'LONG_MAX' undeclared (first use in this function)
    date.c:223: error: (Each undeclared identifier is reported only once
    date.c:223: error: for each function it appears in.)
    date.c: In function 'exsltDateParseDuration':
    date.c:1058: error: 'LONG_MAX' undeclared (first use in this function)
    date.c: In function '_exsltDateAdd':
    date.c:1534: error: 'LONG_MAX' undeclared (first use in this function)
    date.c:1535: error: 'LONG_MIN' undeclared (first use in this function)
    date.c: In function '_exsltDateDifference':
    date.c:1671: error: 'LONG_MAX' undeclared (first use in this function)
    date.c:1671: error: 'LONG_MIN' undeclared (first use in this function)
    date.c: In function '_exsltDateAddDurCalc':
    date.c:1717: error: 'LONG_MAX' undeclared (first use in this function)
    date.c:1718: error: 'LONG_MIN' undeclared (first use in this function)
    make[2]: *** [date.lo] Error 1
    make[2]: *** Waiting for unfinished jobs....
    make[2]: Leaving directory `/usr/local/directadmin/custombuild/libxslt-1.1.32/libexslt'
    make[1]: *** [all-recursive] Error 1
    make[1]: Leaving directory `/usr/local/directadmin/custombuild/libxslt-1.1.32'
    make: *** [all] Error 2
    Starting crond: [ OK ]
    *******************************************
    *******************************************

    Cannot find /usr/local/bin/php
    Please recompile php with custombuild, eg:
    cd /usr/local/directadmin/custombuild
    ./build all d

  2. #2
    Join Date
    Dec 2017
    Posts
    1

    I had the same issue

    Hello,I had the same issue,do you resolve the issue?

  3. #3
    Join Date
    Dec 2017
    Posts
    1

    I also had the same issue

    Hello,I had the same issue,do you resolve the issue?

  4. #4
    Join Date
    Apr 2005
    Location
    GMT +7.00
    Posts
    12,481
    Hello,

    I don't think it relates to a kernel version. I don't have the issue on CentOS 6 with 2.6.32-696.16.1.el6.x86_64.

    What if you try to install earlier version?

    Code:
    cd /usr/local/directadmin/custombuild
    echo "libxslt:1.1.29:a129d3c44c022de3b9dcf6d6f288d72e" >> custom_versions.txt
    ./build libxslt

  5. #5
    Join Date
    May 2016
    Posts
    10
    WHY?!??! No matter what it keeps trying to build 1.1.32 and fails!!!!!

    cd /usr/local/directadmin/custombuild
    echo "libxslt:1.1.29:a129d3c44c022de3b9dcf6d6f288d72e" >> custom_versions.txt

    ./build libxslt
    File already exists: libxslt-1.1.32.tar.gz
    MD5 Checksum on libxslt-1.1.32.tar.gz passed.
    Found /usr/local/directadmin/custombuild/libxslt-1.1.32.tar.gz
    Extracting ...
    Done.
    Configuring libxslt-1.1.32...

Posting Permissions

  • You may not post new threads
  • You may not post replies
  • You may not post attachments
  • You may not edit your posts
  •